{"text_format":"1","workbook":"xlsx","n_sheets":2,"sheets":["Illustration Calculator","Plan Calculations"],"not_rendered":{"charts":0,"images":0,"macros":0,"external_links":0,"defined_names":0,"comments":0,"pivot_tables":0},"unopened":[],"bounds":{"document_bytes":16777216,"sheet_cells":100000,"rows_first":2000,"rows_last":500,"rows_between":2000,"halvings":0,"cell_chars":16384,"cell_head_chars":4096},"cells_cut":0,"cells_raw":0,"read":"whole","date_system":"1900"}

{"sheet":"Illustration Calculator","index":0,"n_rows":105,"n_cols":8,"rows_kept":105,"cut":false,"hidden":false,"merged":[[10,7,10,8],[11,7,11,8],[1,1,1,9],[2,1,2,9],[4,7,4,8],[5,7,5,8],[7,7,7,8],[8,7,8,8]]}
[]
[null,"ILLUSTRATION TOOL"]
[null,"For Agent Use Only"]
[]
[null,"Plan # Selection",null,"Age","Year","Exp. Annuity Payment",null,"Total Payment"]
[null,"Plan # 7",null,{"$f":"B9","v":40},1,{"$f":"_xlfn.IFNA(IF(E6=\"\", \"\",HLOOKUP($B$6, 'Plan Calculations'!$G$2:$L$75, E6+1, FALSE)), \"Something is wrong\")","v":0},null,{"$f":"SUM(F6:F105)","v":180000}]
[null,null,null,{"$f":"IF(E7=\"\", \"\", D6+1)","v":41},{"$f":"IF(E6=\"\", \"\", IF($B$9+E6-1>=110, \"\", E6+1))","v":2},{"$f":"_xlfn.IFNA(IF(E7=\"\", \"\",HLOOKUP($B$6, 'Plan Calculations'!$G$2:$L$75, E7+1, FALSE)), \"Something is wrong\")","v":0}]
[null,"Current Age",null,{"$f":"IF(E8=\"\", \"\", D7+1)","v":42},{"$f":"IF(E7=\"\", \"\", IF($B$9+E7-1>=110, \"\", E7+1))","v":3},{"$f":"_xlfn.IFNA(IF(E8=\"\", \"\",HLOOKUP($B$6, 'Plan Calculations'!$G$2:$L$75, E8+1, FALSE)), \"Something is wrong\")","v":0},null,"Total Years of Payment"]
[null,40,null,43,4,{"$f":"_xlfn.IFNA(IF(E9=\"\", \"\",HLOOKUP($B$6, 'Plan Calculations'!$G$2:$L$75, E9+1, FALSE)), \"Something is wrong\")","v":0},null,{"$f":"COUNTIF(F6:F105, \">0\")","v":5}]
[null,null,null,44,5,{"$f":"_xlfn.IFNA(IF(E10=\"\", \"\",HLOOKUP($B$6, 'Plan Calculations'!$G$2:$L$75, E10+1, FALSE)), \"Something is wrong\")","v":0}]
[null,{"$f":"IF(OR(B6=\"Plan # 1\", B6=\"Plan # 3\", B6=\"Plan # 5\", B6=\"Plan # 6\", B6=\"plan # 7\"), \"Age Payments Begin\", \"\")","v":"Age Payments Begin"},null,45,6,{"$f":"_xlfn.IFNA(IF(E11=\"\", \"\",HLOOKUP($B$6, 'Plan Calculations'!$G$2:$L$75, E11+1, FALSE)), \"Something is wrong\")","v":0},null,"Age of Last Payment"]
[null,41,null,46,7,{"$f":"_xlfn.IFNA(IF(E12=\"\", \"\",HLOOKUP($B$6, 'Plan Calculations'!$G$2:$L$75, E12+1, FALSE)), \"Something is wrong\")","v":0},null,{"$f":"IF(OR(B6=\"Plan # 1\", B6=\"plan # 5\", B6=\"plan # 6\", B6=\"plan # 7\"), B12+B15-1, IF(B6=\"Plan # 2\", 94, IF(B6=\"Plan # 3\", 110, 100)))","v":50}]
[null,null,null,47,8,{"$f":"_xlfn.IFNA(IF(E13=\"\", \"\",HLOOKUP($B$6, 'Plan Calculations'!$G$2:$L$75, E13+1, FALSE)), \"Something is wrong\")","v":30000}]
[null,{"$f":"IF(OR(B6=\"Plan # 1\", B6=\"Plan # 5\", B6=\"Plan # 6\", B6=\"plan # 7\"), \"Years of Payment\", \"\")","v":"Years of Payment"},null,48,9,{"$f":"_xlfn.IFNA(IF(E14=\"\", \"\",HLOOKUP($B$6, 'Plan Calculations'!$G$2:$L$75, E14+1, FALSE)), \"Something is wrong\")","v":0}]
[null,10,null,49,10,{"$f":"_xlfn.IFNA(IF(E15=\"\", \"\",HLOOKUP($B$6, 'Plan Calculations'!$G$2:$L$75, E15+1, FALSE)), \"Something is wrong\")","v":30000}]
[null,null,null,50,11,{"$f":"_xlfn.IFNA(IF(E16=\"\", \"\",HLOOKUP($B$6, 'Plan Calculations'!$G$2:$L$75, E16+1, FALSE)), \"Something is wrong\")","v":0}]
[null,null,null,51,12,{"$f":"_xlfn.IFNA(IF(E17=\"\", \"\",HLOOKUP($B$6, 'Plan Calculations'!$G$2:$L$75, E17+1, FALSE)), \"Something is wrong\")","v":60000}]
[null,null,null,52,13,{"$f":"_xlfn.IFNA(IF(E18=\"\", \"\",HLOOKUP($B$6, 'Plan Calculations'!$G$2:$L$75, E18+1, FALSE)), \"Something is wrong\")","v":0}]
[null,null,null,53,14,{"$f":"_xlfn.IFNA(IF(E19=\"\", \"\",HLOOKUP($B$6, 'Plan Calculations'!$G$2:$L$75, E19+1, FALSE)), \"Something is wrong\")","v":30000}]
[null,null,null,54,15,{"$f":"_xlfn.IFNA(IF(E20=\"\", \"\",HLOOKUP($B$6, 'Plan Calculations'!$F$2:$L$75, E20+1, FALSE)), \"Something is wrong\")","v":0}]
[null,null,null,55,16,{"$f":"_xlfn.IFNA(IF(E21=\"\", \"\",HLOOKUP($B$6, 'Plan Calculations'!$F$2:$L$75, E21+1, FALSE)), \"Something is wrong\")","v":30000}]
[null,null,null,56,17,{"$f":"_xlfn.IFNA(IF(E22=\"\", \"\",HLOOKUP($B$6, 'Plan Calculations'!$F$2:$L$75, E22+1, FALSE)), \"Something is wrong\")","v":0}]
[null,null,null,57,18,{"$f":"_xlfn.IFNA(IF(E23=\"\", \"\",HLOOKUP($B$6, 'Plan Calculations'!$F$2:$L$75, E23+1, FALSE)), \"Something is wrong\")","v":0}]
[null,null,null,58,19,{"$f":"_xlfn.IFNA(IF(E24=\"\", \"\",HLOOKUP($B$6, 'Plan Calculations'!$F$2:$L$75, E24+1, FALSE)), \"Something is wrong\")","v":0}]
[null,null,null,59,20,{"$f":"_xlfn.IFNA(IF(E25=\"\", \"\",HLOOKUP($B$6, 'Plan Calculations'!$F$2:$L$75, E25+1, FALSE)), \"Something is wrong\")","v":0}]
[null,null,null,60,21,{"$f":"_xlfn.IFNA(IF(E26=\"\", \"\",HLOOKUP($B$6, 'Plan Calculations'!$F$2:$L$75, E26+1, FALSE)), \"Something is wrong\")","v":0}]
[null,null,null,61,22,{"$f":"_xlfn.IFNA(IF(E27=\"\", \"\",HLOOKUP($B$6, 'Plan Calculations'!$F$2:$L$75, E27+1, FALSE)), \"Something is wrong\")","v":0}]
[null,null,null,62,23,{"$f":"_xlfn.IFNA(IF(E28=\"\", \"\",HLOOKUP($B$6, 'Plan Calculations'!$F$2:$L$75, E28+1, FALSE)), \"Something is wrong\")","v":0}]
[null,null,null,63,24,{"$f":"_xlfn.IFNA(IF(E29=\"\", \"\",HLOOKUP($B$6, 'Plan Calculations'!$F$2:$L$75, E29+1, FALSE)), \"Something is wrong\")","v":0}]
[null,null,null,64,25,{"$f":"_xlfn.IFNA(IF(E30=\"\", \"\",HLOOKUP($B$6, 'Plan Calculations'!$F$2:$L$75, E30+1, FALSE)), \"Something is wrong\")","v":0}]
{"$rows_left_out":76}
{"sheet":"Plan Calculations","index":1,"n_rows":75,"n_cols":12,"rows_kept":75,"cut":false,"hidden":false,"merged":[]}
[]
[null,"Years of Payment",null,null,null,"Plan # 1","Plan # 2","Plan # 3","Plan # 4","Plan # 5","Plan # 6","Plan # 7"]
[null,{"$f":"'Illustration Calculator'!B15","v":10},{"$f":"B6","v":40},1,"Year 1",{"$f":"IF(AND($B$6+D3-1>=$B$9, $B$6+D3-1<$B$9+$B$3), 15000, 0)","v":0},{"$f":"IF($B$6+D3-1< 95, IF($B$6+D3-1=65, 25000, IF($B$6+D3-1>65, 25000+1000*($B$6+D3-1-65), 0)), 0)","v":0},{"$f":"IF(OR($B$6+D3-1<$B$9, $B$6+D3-1>110), 0, 600*12)","v":0},{"$f":"IF(AND($B$6+D3-1>=60, $B$6+D3-1<=100), ($B$6+D3-1)*1000, 0)","v":0},{"$f":"IF(AND($B$6+D3-1>=$B$9, $B$6+D3-1<$B$9+$B$3), IF($B$6+D3-1<($B$9+$B$3/2), 19000, 25000), 0)","v":0},{"$f":"IF(AND($B$6+D3-1>=$B$9, $B$6+D3-1<($B$9+$B$3)), 100000/($B$3-1), 0)","v":0},{"$f":"IF(AND($B$6+D3-1>=$B$9,$B$6+D3-1<$B$9+$B$3),IF(AND(ISEVEN($B$6+D3-1), ISEVEN($B$9)),30000,IF(AND(ISODD($B$6+D3-1), ISODD($B$9)), 30000,0)), 0)","v":0}]
[null,null,{"$f":"C3+1","v":41},2,"Year 2",{"$f":"IF(AND($B$6+D4-1>=$B$9, $B$6+D4-1<$B$9+$B$3), 15000, 0)","v":0},{"$f":"IF($B$6+D4-1< 95, IF($B$6+D4-1=65, 25000, IF($B$6+D4-1>65, 25000+1000*($B$6+D4-1-65), 0)), 0)","v":0},{"$f":"IF(OR($B$6+D4-1<$B$9, $B$6+D4-1>110), 0, 600*12)","v":0},{"$f":"IF(AND($B$6+D4-1>=60, $B$6+D4-1<=100), ($B$6+D4-1)*1000, 0)","v":0},{"$f":"IF(AND($B$6+D4-1>=$B$9, $B$6+D4-1<$B$9+$B$3), IF($B$6+D4-1<($B$9+$B$3/2), 19000, 25000), 0)","v":0},0,0]
[null,"Current Age of Client",{"$f":"C4+1","v":42},3,"Year 3",{"$f":"IF(AND($B$6+D5-1>=$B$9, $B$6+D5-1<$B$9+$B$3), 15000, 0)","v":0},{"$f":"IF($B$6+D5-1< 95, IF($B$6+D5-1=65, 25000, IF($B$6+D5-1>65, 25000+1000*($B$6+D5-1-65), 0)), 0)","v":0},{"$f":"IF(OR($B$6+D5-1<$B$9, $B$6+D5-1>110), 0, 600*12)","v":0},{"$f":"IF(AND($B$6+D5-1>=60, $B$6+D5-1<=100), ($B$6+D5-1)*1000, 0)","v":0},{"$f":"IF(AND($B$6+D5-1>=$B$9, $B$6+D5-1<$B$9+$B$3), IF($B$6+D5-1<($B$9+$B$3/2), 19000, 25000), 0)","v":0},0,{"$f":"IF(AND($B$6+D5-1>=$B$9,$B$6+D5-1<$B$9+$B$3),IF(AND(ISEVEN($B$6+D5-1), ISEVEN($B$9)),30000,IF(AND(ISODD($B$6+D5-1), ISODD($B$9)), 30000,0)), 0)","v":0}]
[null,{"$f":"'Illustration Calculator'!B9","v":40},43,4,"Year 4",{"$f":"IF(AND($B$6+D6-1>=$B$9, $B$6+D6-1<$B$9+$B$3), 15000, 0)","v":0},{"$f":"IF($B$6+D6-1< 95, IF($B$6+D6-1=65, 25000, IF($B$6+D6-1>65, 25000+1000*($B$6+D6-1-65), 0)), 0)","v":0},{"$f":"IF(OR($B$6+D6-1<$B$9, $B$6+D6-1>110), 0, 600*12)","v":0},{"$f":"IF(AND($B$6+D6-1>=60, $B$6+D6-1<=100), ($B$6+D6-1)*1000, 0)","v":0},{"$f":"IF(AND($B$6+D6-1>=$B$9, $B$6+D6-1<$B$9+$B$3), IF($B$6+D6-1<($B$9+$B$3/2), 19000, 25000), 0)","v":0},0,{"$f":"IF(AND($B$6+D6-1>=$B$9,$B$6+D6-1<$B$9+$B$3),IF(AND(ISEVEN($B$6+D6-1), ISEVEN($B$9)),30000,IF(AND(ISODD($B$6+D6-1), ISODD($B$9)), 30000,0)), 0)","v":0}]
[null,null,44,5,"Year 5",{"$f":"IF(AND($B$6+D7-1>=$B$9, $B$6+D7-1<$B$9+$B$3), 15000, 0)","v":0},{"$f":"IF($B$6+D7-1< 95, IF($B$6+D7-1=65, 25000, IF($B$6+D7-1>65, 25000+1000*($B$6+D7-1-65), 0)), 0)","v":0},{"$f":"IF(OR($B$6+D7-1<$B$9, $B$6+D7-1>110), 0, 600*12)","v":0},{"$f":"IF(AND($B$6+D7-1>=60, $B$6+D7-1<=100), ($B$6+D7-1)*1000, 0)","v":0},{"$f":"IF(AND($B$6+D7-1>=$B$9, $B$6+D7-1<$B$9+$B$3), IF($B$6+D7-1<($B$9+$B$3/2), 19000, 25000), 0)","v":0},0,0]
[null,"Age Payments begin",45,6,"Year 6",{"$f":"IF(AND($B$6+D8-1>=$B$9, $B$6+D8-1<$B$9+$B$3), 15000, 0)","v":0},{"$f":"IF($B$6+D8-1< 95, IF($B$6+D8-1=65, 25000, IF($B$6+D8-1>65, 25000+1000*($B$6+D8-1-65), 0)), 0)","v":0},{"$f":"IF(OR($B$6+D8-1<$B$9, $B$6+D8-1>110), 0, 600*12)","v":0},{"$f":"IF(AND($B$6+D8-1>=60, $B$6+D8-1<=100), ($B$6+D8-1)*1000, 0)","v":0},{"$f":"IF(AND($B$6+D8-1>=$B$9, $B$6+D8-1<$B$9+$B$3), IF($B$6+D8-1<($B$9+$B$3/2), 19000, 25000), 0)","v":0},0,0]
[null,{"$f":"'Illustration Calculator'!B12+6","v":47},46,7,"Year 7",{"$f":"IF(AND($B$6+D9-1>=$B$9, $B$6+D9-1<$B$9+$B$3), 15000, 0)","v":0},{"$f":"IF($B$6+D9-1< 95, IF($B$6+D9-1=65, 25000, IF($B$6+D9-1>65, 25000+1000*($B$6+D9-1-65), 0)), 0)","v":0},{"$f":"IF(OR($B$6+D9-1<$B$9, $B$6+D9-1>110), 0, 600*12)","v":0},{"$f":"IF(AND($B$6+D9-1>=60, $B$6+D9-1<=100), ($B$6+D9-1)*1000, 0)","v":0},{"$f":"IF(AND($B$6+D9-1>=$B$9, $B$6+D9-1<$B$9+$B$3), IF($B$6+D9-1<($B$9+$B$3/2), 19000, 25000), 0)","v":0},0,0]
[null,null,47,8,"Year 8",{"$f":"IF(AND($B$6+D10-1>=$B$9, $B$6+D10-1<$B$9+$B$3), 15000, 0)","v":15000},{"$f":"IF($B$6+D10-1< 95, IF($B$6+D10-1=65, 25000, IF($B$6+D10-1>65, 25000+1000*($B$6+D10-1-65), 0)), 0)","v":0},{"$f":"IF(OR($B$6+D10-1<$B$9, $B$6+D10-1>110), 0, 600*12)","v":7200},{"$f":"IF(AND($B$6+D10-1>=60, $B$6+D10-1<=100), ($B$6+D10-1)*1000, 0)","v":0},{"$f":"IF(AND($B$6+D10-1>=$B$9, $B$6+D10-1<$B$9+$B$3), IF($B$6+D10-1<($B$9+$B$3/2), 19000, 25000), 0)","v":19000},11111.111111111111,30000]
[null,null,48,9,"Year 9",{"$f":"IF(AND($B$6+D11-1>=$B$9, $B$6+D11-1<$B$9+$B$3), 15000, 0)","v":15000},{"$f":"IF($B$6+D11-1< 95, IF($B$6+D11-1=65, 25000, IF($B$6+D11-1>65, 25000+1000*($B$6+D11-1-65), 0)), 0)","v":0},{"$f":"IF(OR($B$6+D11-1<$B$9, $B$6+D11-1>110), 0, 600*12)","v":7200},{"$f":"IF(AND($B$6+D11-1>=60, $B$6+D11-1<=100), ($B$6+D11-1)*1000, 0)","v":0},{"$f":"IF(AND($B$6+D11-1>=$B$9, $B$6+D11-1<$B$9+$B$3), IF($B$6+D11-1<($B$9+$B$3/2), 19000, 25000), 0)","v":19000},11111.111111111111,0]
[null,null,49,10,"Year 10",{"$f":"IF(AND($B$6+D12-1>=$B$9, $B$6+D12-1<$B$9+$B$3), 15000, 0)","v":15000},{"$f":"IF($B$6+D12-1< 95, IF($B$6+D12-1=65, 25000, IF($B$6+D12-1>65, 25000+1000*($B$6+D12-1-65), 0)), 0)","v":0},{"$f":"IF(OR($B$6+D12-1<$B$9, $B$6+D12-1>110), 0, 600*12)","v":7200},{"$f":"IF(AND($B$6+D12-1>=60, $B$6+D12-1<=100), ($B$6+D12-1)*1000, 0)","v":0},{"$f":"IF(AND($B$6+D12-1>=$B$9, $B$6+D12-1<$B$9+$B$3), IF($B$6+D12-1<($B$9+$B$3/2), 19000, 25000), 0)","v":19000},11111.111111111111,30000]
[null,null,50,11,"Year 11",{"$f":"IF(AND($B$6+D13-1>=$B$9, $B$6+D13-1<$B$9+$B$3), 15000, 0)","v":15000},{"$f":"IF($B$6+D13-1< 95, IF($B$6+D13-1=65, 25000, IF($B$6+D13-1>65, 25000+1000*($B$6+D13-1-65), 0)), 0)","v":0},{"$f":"IF(OR($B$6+D13-1<$B$9, $B$6+D13-1>110), 0, 600*12)","v":7200},{"$f":"IF(AND($B$6+D13-1>=60, $B$6+D13-1<=100), ($B$6+D13-1)*1000, 0)","v":0},{"$f":"IF(AND($B$6+D13-1>=$B$9, $B$6+D13-1<$B$9+$B$3), IF($B$6+D13-1<($B$9+$B$3/2), 19000, 25000), 0)","v":19000},11111.111111111111,0]
[null,null,51,12,"Year 12",{"$f":"IF(AND($B$6+D14-1>=$B$9, $B$6+D14-1<$B$9+$B$3), 15000, 0)","v":15000},{"$f":"IF($B$6+D14-1< 95, IF($B$6+D14-1=65, 25000, IF($B$6+D14-1>65, 25000+1000*($B$6+D14-1-65), 0)), 0)","v":0},{"$f":"IF(OR($B$6+D14-1<$B$9, $B$6+D14-1>110), 0, 600*12)","v":7200},{"$f":"IF(AND($B$6+D14-1>=60, $B$6+D14-1<=100), ($B$6+D14-1)*1000, 0)","v":0},{"$f":"IF(AND($B$6+D14-1>=$B$9, $B$6+D14-1<$B$9+$B$3), IF($B$6+D14-1<($B$9+$B$3/2), 19000, 25000), 0)","v":19000},11111.111111111111,{"$f":"IF(AND($B$6+D14-1>=$B$9,$B$6+D14-1<$B$9+$B$3),IF(AND(ISEVEN($B$6+D14-1), ISEVEN($B$9)),30000,IF(AND(ISODD($B$6+D14-1), ISODD($B$9)), 30000*2,0)), 0)","v":60000}]
[null,null,52,13,"Year 13",{"$f":"IF(AND($B$6+D15-1>=$B$9, $B$6+D15-1<$B$9+$B$3), 15000, 0)","v":15000},{"$f":"IF($B$6+D15-1< 95, IF($B$6+D15-1=65, 25000, IF($B$6+D15-1>65, 25000+1000*($B$6+D15-1-65), 0)), 0)","v":0},{"$f":"IF(OR($B$6+D15-1<$B$9, $B$6+D15-1>110), 0, 600*12)","v":7200},{"$f":"IF(AND($B$6+D15-1>=60, $B$6+D15-1<=100), ($B$6+D15-1)*1000, 0)","v":0},{"$f":"IF(AND($B$6+D15-1>=$B$9, $B$6+D15-1<$B$9+$B$3), IF($B$6+D15-1<($B$9+$B$3/2), 19000, 25000), 0)","v":25000},11111.111111111111,0]
[null,null,53,14,"Year 14",{"$f":"IF(AND($B$6+D16-1>=$B$9, $B$6+D16-1<$B$9+$B$3), 15000, 0)","v":15000},{"$f":"IF($B$6+D16-1< 95, IF($B$6+D16-1=65, 25000, IF($B$6+D16-1>65, 25000+1000*($B$6+D16-1-65), 0)), 0)","v":0},{"$f":"IF(OR($B$6+D16-1<$B$9, $B$6+D16-1>110), 0, 600*12)","v":7200},{"$f":"IF(AND($B$6+D16-1>=60, $B$6+D16-1<=100), ($B$6+D16-1)*1000, 0)","v":0},{"$f":"IF(AND($B$6+D16-1>=$B$9, $B$6+D16-1<$B$9+$B$3), IF($B$6+D16-1<($B$9+$B$3/2), 19000, 25000), 0)","v":25000},11111.111111111111,30000]
[null,null,54,15,"Year 15",{"$f":"IF(AND($B$6+D17-1>=$B$9, $B$6+D17-1<$B$9+$B$3), 15000, 0)","v":15000},{"$f":"IF($B$6+D17-1< 95, IF($B$6+D17-1=65, 25000, IF($B$6+D17-1>65, 25000+1000*($B$6+D17-1-65), 0)), 0)","v":0},{"$f":"IF(OR($B$6+D17-1<$B$9, $B$6+D17-1>110), 0, 600*12)","v":7200},{"$f":"IF(AND($B$6+D17-1>=60, $B$6+D17-1<=100), ($B$6+D17-1)*1000, 0)","v":0},{"$f":"IF(AND($B$6+D17-1>=$B$9, $B$6+D17-1<$B$9+$B$3), IF($B$6+D17-1<($B$9+$B$3/2), 19000, 25000), 0)","v":25000},11111.111111111111,0]
[null,null,55,16,"Year 16",{"$f":"IF(AND($B$6+D18-1>=$B$9, $B$6+D18-1<$B$9+$B$3), 15000, 0)","v":15000},{"$f":"IF($B$6+D18-1< 95, IF($B$6+D18-1=65, 25000, IF($B$6+D18-1>65, 25000+1000*($B$6+D18-1-65), 0)), 0)","v":0},{"$f":"IF(OR($B$6+D18-1<$B$9, $B$6+D18-1>110), 0, 600*12)","v":7200},{"$f":"IF(AND($B$6+D18-1>=60, $B$6+D18-1<=100), ($B$6+D18-1)*1000, 0)","v":0},{"$f":"IF(AND($B$6+D18-1>=$B$9, $B$6+D18-1<$B$9+$B$3), IF($B$6+D18-1<($B$9+$B$3/2), 19000, 25000), 0)","v":25000},{"$f":"IF(AND($B$6+D18-1>=$B$9, $B$6+D18-1<($B$9+$B$3)), 100000/($B$3-1), 0)","v":11111.111111111111},30000]
[null,null,56,17,"Year 17",{"$f":"IF(AND($B$6+D19-1>=$B$9, $B$6+D19-1<$B$9+$B$3), 15000, 0)","v":15000},{"$f":"IF($B$6+D19-1< 95, IF($B$6+D19-1=65, 25000, IF($B$6+D19-1>65, 25000+1000*($B$6+D19-1-65), 0)), 0)","v":0},{"$f":"IF(OR($B$6+D19-1<$B$9, $B$6+D19-1>110), 0, 600*12)","v":7200},{"$f":"IF(AND($B$6+D19-1>=60, $B$6+D19-1<=100), ($B$6+D19-1)*1000, 0)","v":0},{"$f":"IF(AND($B$6+D19-1>=$B$9, $B$6+D19-1<$B$9+$B$3), IF($B$6+D19-1<($B$9+$B$3/2), 19000, 25000), 0)","v":25000},{"$f":"IF(AND($B$6+D19-1>=$B$9, $B$6+D19-1<($B$9+$B$3)), 100000/($B$3-1), 0)","v":11111.111111111111},0]
[null,null,57,18,"Year 18",{"$f":"IF(AND($B$6+D20-1>=$B$9, $B$6+D20-1<$B$9+$B$3), 15000, 0)","v":0},{"$f":"IF($B$6+D20-1< 95, IF($B$6+D20-1=65, 25000, IF($B$6+D20-1>65, 25000+1000*($B$6+D20-1-65), 0)), 0)","v":0},{"$f":"IF(OR($B$6+D20-1<$B$9, $B$6+D20-1>110), 0, 600*12)","v":7200},{"$f":"IF(AND($B$6+D20-1>=60, $B$6+D20-1<=100), ($B$6+D20-1)*1000, 0)","v":0},{"$f":"IF(AND($B$6+D20-1>=$B$9, $B$6+D20-1<$B$9+$B$3), IF($B$6+D20-1<($B$9+$B$3/2), 19000, 25000), 0)","v":0},0,0]
[null,null,58,19,"Year 19",{"$f":"IF(AND($B$6+D21-1>=$B$9, $B$6+D21-1<$B$9+$B$3), 15000, 0)","v":0},{"$f":"IF($B$6+D21-1< 95, IF($B$6+D21-1=65, 25000, IF($B$6+D21-1>65, 25000+1000*($B$6+D21-1-65), 0)), 0)","v":0},{"$f":"IF(OR($B$6+D21-1<$B$9, $B$6+D21-1>110), 0, 600*12)","v":7200},{"$f":"IF(AND($B$6+D21-1>=60, $B$6+D21-1<=100), ($B$6+D21-1)*1000, 0)","v":0},{"$f":"IF(AND($B$6+D21-1>=$B$9, $B$6+D21-1<$B$9+$B$3), IF($B$6+D21-1<($B$9+$B$3/2), 19000, 25000), 0)","v":0},0,0]
[null,null,59,20,"Year 20",{"$f":"IF(AND($B$6+D22-1>=$B$9, $B$6+D22-1<$B$9+$B$3), 15000, 0)","v":0},{"$f":"IF($B$6+D22-1< 95, IF($B$6+D22-1=65, 25000, IF($B$6+D22-1>65, 25000+1000*($B$6+D22-1-65), 0)), 0)","v":0},{"$f":"IF(OR($B$6+D22-1<$B$9, $B$6+D22-1>110), 0, 600*12)","v":7200},{"$f":"IF(AND($B$6+D22-1>=60, $B$6+D22-1<=100), ($B$6+D22-1)*1000, 0)","v":0},{"$f":"IF(AND($B$6+D22-1>=$B$9, $B$6+D22-1<$B$9+$B$3), IF($B$6+D22-1<($B$9+$B$3/2), 19000, 25000), 0)","v":0},0,0]
[null,null,60,21,"Year 21",{"$f":"IF(AND($B$6+D23-1>=$B$9, $B$6+D23-1<$B$9+$B$3), 15000, 0)","v":0},{"$f":"IF($B$6+D23-1< 95, IF($B$6+D23-1=65, 25000, IF($B$6+D23-1>65, 25000+1000*($B$6+D23-1-65), 0)), 0)","v":0},{"$f":"IF(OR($B$6+D23-1<$B$9, $B$6+D23-1>110), 0, 600*12)","v":7200},{"$f":"IF(AND($B$6+D23-1>=60, $B$6+D23-1<=100), ($B$6+D23-1)*1000, 0)","v":60000},{"$f":"IF(AND($B$6+D23-1>=$B$9, $B$6+D23-1<$B$9+$B$3), IF($B$6+D23-1<($B$9+$B$3/2), 19000, 25000), 0)","v":0},0,0]
[null,null,61,22,"Year 22",{"$f":"IF(AND($B$6+D24-1>=$B$9, $B$6+D24-1<$B$9+$B$3), 15000, 0)","v":0},{"$f":"IF($B$6+D24-1< 95, IF($B$6+D24-1=65, 25000, IF($B$6+D24-1>65, 25000+1000*($B$6+D24-1-65), 0)), 0)","v":0},{"$f":"IF(OR($B$6+D24-1<$B$9, $B$6+D24-1>110), 0, 600*12)","v":7200},{"$f":"IF(AND($B$6+D24-1>=60, $B$6+D24-1<=100), ($B$6+D24-1)*1000, 0)","v":61000},{"$f":"IF(AND($B$6+D24-1>=$B$9, $B$6+D24-1<$B$9+$B$3), IF($B$6+D24-1<($B$9+$B$3/2), 19000, 25000), 0)","v":0},0,0]
[null,null,62,23,"Year 23",{"$f":"IF(AND($B$6+D25-1>=$B$9, $B$6+D25-1<$B$9+$B$3), 15000, 0)","v":0},{"$f":"IF($B$6+D25-1< 95, IF($B$6+D25-1=65, 25000, IF($B$6+D25-1>65, 25000+1000*($B$6+D25-1-65), 0)), 0)","v":0},{"$f":"IF(OR($B$6+D25-1<$B$9, $B$6+D25-1>110), 0, 600*12)","v":7200},{"$f":"IF(AND($B$6+D25-1>=60, $B$6+D25-1<=100), ($B$6+D25-1)*1000, 0)","v":62000},{"$f":"IF(AND($B$6+D25-1>=$B$9, $B$6+D25-1<$B$9+$B$3), IF($B$6+D25-1<($B$9+$B$3/2), 19000, 25000), 0)","v":0},0,0]
[null,null,63,24,"Year 24",{"$f":"IF(AND($B$6+D26-1>=$B$9, $B$6+D26-1<$B$9+$B$3), 15000, 0)","v":0},{"$f":"IF($B$6+D26-1< 95, IF($B$6+D26-1=65, 25000, IF($B$6+D26-1>65, 25000+1000*($B$6+D26-1-65), 0)), 0)","v":0},{"$f":"IF(OR($B$6+D26-1<$B$9, $B$6+D26-1>110), 0, 600*12)","v":7200},{"$f":"IF(AND($B$6+D26-1>=60, $B$6+D26-1<=100), ($B$6+D26-1)*1000, 0)","v":63000},{"$f":"IF(AND($B$6+D26-1>=$B$9, $B$6+D26-1<$B$9+$B$3), IF($B$6+D26-1<($B$9+$B$3/2), 19000, 25000), 0)","v":0},0,0]
[null,null,64,25,"Year 25",{"$f":"IF(AND($B$6+D27-1>=$B$9, $B$6+D27-1<$B$9+$B$3), 15000, 0)","v":0},{"$f":"IF($B$6+D27-1< 95, IF($B$6+D27-1=65, 25000, IF($B$6+D27-1>65, 25000+1000*($B$6+D27-1-65), 0)), 0)","v":0},{"$f":"IF(OR($B$6+D27-1<$B$9, $B$6+D27-1>110), 0, 600*12)","v":7200},{"$f":"IF(AND($B$6+D27-1>=60, $B$6+D27-1<=100), ($B$6+D27-1)*1000, 0)","v":64000},{"$f":"IF(AND($B$6+D27-1>=$B$9, $B$6+D27-1<$B$9+$B$3), IF($B$6+D27-1<($B$9+$B$3/2), 19000, 25000), 0)","v":0},0,0]
[null,null,65,26,"Year 26",{"$f":"IF(AND($B$6+D28-1>=$B$9, $B$6+D28-1<$B$9+$B$3), 15000, 0)","v":0},{"$f":"IF($B$6+D28-1< 95, IF($B$6+D28-1=65, 25000, IF($B$6+D28-1>65, 25000+1000*($B$6+D28-1-65), 0)), 0)","v":25000},{"$f":"IF(OR($B$6+D28-1<$B$9, $B$6+D28-1>110), 0, 600*12)","v":7200},{"$f":"IF(AND($B$6+D28-1>=60, $B$6+D28-1<=100), ($B$6+D28-1)*1000, 0)","v":65000},{"$f":"IF(AND($B$6+D28-1>=$B$9, $B$6+D28-1<$B$9+$B$3), IF($B$6+D28-1<($B$9+$B$3/2), 19000, 25000), 0)","v":0},0,0]
[null,null,66,27,"Year 27",{"$f":"IF(AND($B$6+D29-1>=$B$9, $B$6+D29-1<$B$9+$B$3), 15000, 0)","v":0},{"$f":"IF($B$6+D29-1< 95, IF($B$6+D29-1=65, 25000, IF($B$6+D29-1>65, 25000+1000*($B$6+D29-1-65), 0)), 0)","v":26000},{"$f":"IF(OR($B$6+D29-1<$B$9, $B$6+D29-1>110), 0, 600*12)","v":7200},{"$f":"IF(AND($B$6+D29-1>=60, $B$6+D29-1<=100), ($B$6+D29-1)*1000, 0)","v":66000},{"$f":"IF(AND($B$6+D29-1>=$B$9, $B$6+D29-1<$B$9+$B$3), IF($B$6+D29-1<($B$9+$B$3/2), 19000, 25000), 0)","v":0},0,0]
[null,null,67,28,"Year 28",{"$f":"IF(AND($B$6+D30-1>=$B$9, $B$6+D30-1<$B$9+$B$3), 15000, 0)","v":0},{"$f":"IF($B$6+D30-1< 95, IF($B$6+D30-1=65, 25000, IF($B$6+D30-1>65, 25000+1000*($B$6+D30-1-65), 0)), 0)","v":27000},{"$f":"IF(OR($B$6+D30-1<$B$9, $B$6+D30-1>110), 0, 600*12)","v":7200},{"$f":"IF(AND($B$6+D30-1>=60, $B$6+D30-1<=100), ($B$6+D30-1)*1000, 0)","v":67000},{"$f":"IF(AND($B$6+D30-1>=$B$9, $B$6+D30-1<$B$9+$B$3), IF($B$6+D30-1<($B$9+$B$3/2), 19000, 25000), 0)","v":0},0,0]
{"$rows_left_out":45}